AWS SDK for C++  1.9.102
AWS SDK for C++
Public Member Functions | List of all members
Aws::ForecastService::Model::TestWindowSummary Class Reference

#include <TestWindowSummary.h>

Public Member Functions

 TestWindowSummary ()
 
 TestWindowSummary (Aws::Utils::Json::JsonView jsonValue)
 
TestWindowSummaryoperator= (Aws::Utils::Json::JsonView jsonValue)
 
Aws::Utils::Json::JsonValue Jsonize () const
 
const Aws::Utils::DateTimeGetTestWindowStart () const
 
bool TestWindowStartHasBeenSet () const
 
void SetTestWindowStart (const Aws::Utils::DateTime &value)
 
void SetTestWindowStart (Aws::Utils::DateTime &&value)
 
TestWindowSummaryWithTestWindowStart (const Aws::Utils::DateTime &value)
 
TestWindowSummaryWithTestWindowStart (Aws::Utils::DateTime &&value)
 
const Aws::Utils::DateTimeGetTestWindowEnd () const
 
bool TestWindowEndHasBeenSet () const
 
void SetTestWindowEnd (const Aws::Utils::DateTime &value)
 
void SetTestWindowEnd (Aws::Utils::DateTime &&value)
 
TestWindowSummaryWithTestWindowEnd (const Aws::Utils::DateTime &value)
 
TestWindowSummaryWithTestWindowEnd (Aws::Utils::DateTime &&value)
 
const Aws::StringGetStatus () const
 
bool StatusHasBeenSet () const
 
void SetStatus (const Aws::String &value)
 
void SetStatus (Aws::String &&value)
 
void SetStatus (const char *value)
 
TestWindowSummaryWithStatus (const Aws::String &value)
 
TestWindowSummaryWithStatus (Aws::String &&value)
 
TestWindowSummaryWithStatus (const char *value)
 
const Aws::StringGetMessage () const
 
bool MessageHasBeenSet () const
 
void SetMessage (const Aws::String &value)
 
void SetMessage (Aws::String &&value)
 
void SetMessage (const char *value)
 
TestWindowSummaryWithMessage (const Aws::String &value)
 
TestWindowSummaryWithMessage (Aws::String &&value)
 
TestWindowSummaryWithMessage (const char *value)
 

Detailed Description

The status, start time, and end time of a backtest, as well as a failure reason if applicable.

See Also:

AWS API Reference

Definition at line 33 of file TestWindowSummary.h.

Constructor & Destructor Documentation

◆ TestWindowSummary() [1/2]

Aws::ForecastService::Model::TestWindowSummary::TestWindowSummary ( )

◆ TestWindowSummary() [2/2]

Aws::ForecastService::Model::TestWindowSummary::TestWindowSummary ( Aws::Utils::Json::JsonView  jsonValue)

Member Function Documentation

◆ GetMessage()

const Aws::String& Aws::ForecastService::Model::TestWindowSummary::GetMessage ( ) const
inline

If the test failed, the reason why it failed.

Definition at line 164 of file TestWindowSummary.h.

◆ GetStatus()

const Aws::String& Aws::ForecastService::Model::TestWindowSummary::GetStatus ( ) const
inline

The status of the test. Possible status values are:

  • ACTIVE

  • CREATE_IN_PROGRESS

  • CREATE_FAILED

Definition at line 109 of file TestWindowSummary.h.

◆ GetTestWindowEnd()

const Aws::Utils::DateTime& Aws::ForecastService::Model::TestWindowSummary::GetTestWindowEnd ( ) const
inline

The time at which the test ended.

Definition at line 76 of file TestWindowSummary.h.

◆ GetTestWindowStart()

const Aws::Utils::DateTime& Aws::ForecastService::Model::TestWindowSummary::GetTestWindowStart ( ) const
inline

The time at which the test began.

Definition at line 45 of file TestWindowSummary.h.

◆ Jsonize()

Aws::Utils::Json::JsonValue Aws::ForecastService::Model::TestWindowSummary::Jsonize ( ) const

◆ MessageHasBeenSet()

bool Aws::ForecastService::Model::TestWindowSummary::MessageHasBeenSet ( ) const
inline

If the test failed, the reason why it failed.

Definition at line 169 of file TestWindowSummary.h.

◆ operator=()

TestWindowSummary& Aws::ForecastService::Model::TestWindowSummary::operator= ( Aws::Utils::Json::JsonView  jsonValue)

◆ SetMessage() [1/3]

void Aws::ForecastService::Model::TestWindowSummary::SetMessage ( Aws::String &&  value)
inline

If the test failed, the reason why it failed.

Definition at line 179 of file TestWindowSummary.h.

◆ SetMessage() [2/3]

void Aws::ForecastService::Model::TestWindowSummary::SetMessage ( const Aws::String value)
inline

If the test failed, the reason why it failed.

Definition at line 174 of file TestWindowSummary.h.

◆ SetMessage() [3/3]

void Aws::ForecastService::Model::TestWindowSummary::SetMessage ( const char *  value)
inline

If the test failed, the reason why it failed.

Definition at line 184 of file TestWindowSummary.h.

◆ SetStatus() [1/3]

void Aws::ForecastService::Model::TestWindowSummary::SetStatus ( Aws::String &&  value)
inline

The status of the test. Possible status values are:

  • ACTIVE

  • CREATE_IN_PROGRESS

  • CREATE_FAILED

Definition at line 130 of file TestWindowSummary.h.

◆ SetStatus() [2/3]

void Aws::ForecastService::Model::TestWindowSummary::SetStatus ( const Aws::String value)
inline

The status of the test. Possible status values are:

  • ACTIVE

  • CREATE_IN_PROGRESS

  • CREATE_FAILED

Definition at line 123 of file TestWindowSummary.h.

◆ SetStatus() [3/3]

void Aws::ForecastService::Model::TestWindowSummary::SetStatus ( const char *  value)
inline

The status of the test. Possible status values are:

  • ACTIVE

  • CREATE_IN_PROGRESS

  • CREATE_FAILED

Definition at line 137 of file TestWindowSummary.h.

◆ SetTestWindowEnd() [1/2]

void Aws::ForecastService::Model::TestWindowSummary::SetTestWindowEnd ( Aws::Utils::DateTime &&  value)
inline

The time at which the test ended.

Definition at line 91 of file TestWindowSummary.h.

◆ SetTestWindowEnd() [2/2]

void Aws::ForecastService::Model::TestWindowSummary::SetTestWindowEnd ( const Aws::Utils::DateTime value)
inline

The time at which the test ended.

Definition at line 86 of file TestWindowSummary.h.

◆ SetTestWindowStart() [1/2]

void Aws::ForecastService::Model::TestWindowSummary::SetTestWindowStart ( Aws::Utils::DateTime &&  value)
inline

The time at which the test began.

Definition at line 60 of file TestWindowSummary.h.

◆ SetTestWindowStart() [2/2]

void Aws::ForecastService::Model::TestWindowSummary::SetTestWindowStart ( const Aws::Utils::DateTime value)
inline

The time at which the test began.

Definition at line 55 of file TestWindowSummary.h.

◆ StatusHasBeenSet()

bool Aws::ForecastService::Model::TestWindowSummary::StatusHasBeenSet ( ) const
inline

The status of the test. Possible status values are:

  • ACTIVE

  • CREATE_IN_PROGRESS

  • CREATE_FAILED

Definition at line 116 of file TestWindowSummary.h.

◆ TestWindowEndHasBeenSet()

bool Aws::ForecastService::Model::TestWindowSummary::TestWindowEndHasBeenSet ( ) const
inline

The time at which the test ended.

Definition at line 81 of file TestWindowSummary.h.

◆ TestWindowStartHasBeenSet()

bool Aws::ForecastService::Model::TestWindowSummary::TestWindowStartHasBeenSet ( ) const
inline

The time at which the test began.

Definition at line 50 of file TestWindowSummary.h.

◆ WithMessage() [1/3]

TestWindowSummary& Aws::ForecastService::Model::TestWindowSummary::WithMessage ( Aws::String &&  value)
inline

If the test failed, the reason why it failed.

Definition at line 194 of file TestWindowSummary.h.

◆ WithMessage() [2/3]

TestWindowSummary& Aws::ForecastService::Model::TestWindowSummary::WithMessage ( const Aws::String value)
inline

If the test failed, the reason why it failed.

Definition at line 189 of file TestWindowSummary.h.

◆ WithMessage() [3/3]

TestWindowSummary& Aws::ForecastService::Model::TestWindowSummary::WithMessage ( const char *  value)
inline

If the test failed, the reason why it failed.

Definition at line 199 of file TestWindowSummary.h.

◆ WithStatus() [1/3]

TestWindowSummary& Aws::ForecastService::Model::TestWindowSummary::WithStatus ( Aws::String &&  value)
inline

The status of the test. Possible status values are:

  • ACTIVE

  • CREATE_IN_PROGRESS

  • CREATE_FAILED

Definition at line 151 of file TestWindowSummary.h.

◆ WithStatus() [2/3]

TestWindowSummary& Aws::ForecastService::Model::TestWindowSummary::WithStatus ( const Aws::String value)
inline

The status of the test. Possible status values are:

  • ACTIVE

  • CREATE_IN_PROGRESS

  • CREATE_FAILED

Definition at line 144 of file TestWindowSummary.h.

◆ WithStatus() [3/3]

TestWindowSummary& Aws::ForecastService::Model::TestWindowSummary::WithStatus ( const char *  value)
inline

The status of the test. Possible status values are:

  • ACTIVE

  • CREATE_IN_PROGRESS

  • CREATE_FAILED

Definition at line 158 of file TestWindowSummary.h.

◆ WithTestWindowEnd() [1/2]

TestWindowSummary& Aws::ForecastService::Model::TestWindowSummary::WithTestWindowEnd ( Aws::Utils::DateTime &&  value)
inline

The time at which the test ended.

Definition at line 101 of file TestWindowSummary.h.

◆ WithTestWindowEnd() [2/2]

TestWindowSummary& Aws::ForecastService::Model::TestWindowSummary::WithTestWindowEnd ( const Aws::Utils::DateTime value)
inline

The time at which the test ended.

Definition at line 96 of file TestWindowSummary.h.

◆ WithTestWindowStart() [1/2]

TestWindowSummary& Aws::ForecastService::Model::TestWindowSummary::WithTestWindowStart ( Aws::Utils::DateTime &&  value)
inline

The time at which the test began.

Definition at line 70 of file TestWindowSummary.h.

◆ WithTestWindowStart() [2/2]

TestWindowSummary& Aws::ForecastService::Model::TestWindowSummary::WithTestWindowStart ( const Aws::Utils::DateTime value)
inline

The time at which the test began.

Definition at line 65 of file TestWindowSummary.h.


The documentation for this class was generated from the following file: